RDF description of
primary topic: dissolution

dissolution
type: Concept
subject: Geology @en
subject: Pedology @en
subject: Géologie
subject: Pédologie
definition: Passage en solution de la totalité d'un minéral ou d'une substance solide sous l'action d'un liquide (solvant). (Source : INRA)
in scheme: PLP
note: Rares sont les constituants du sol susceptibles d'être dissous directement et rapidement par les agents climatiques (eaux chargées de gaz carbonique et d'acides organiques). C'est le cas des sels solubles (dont le gypse) mais surtout de la calcite, constituant principal des roches carbonatées. (Source : INRA)
related: http://opendata.inrae.fr/PLP/254
related: http://opendata.inrae.fr/PLP/496
top concept of: PLP