RDF description of
primary topic: dolines

dolines
type: Concept
subject: Pedology
subject: Pédologie @fr
subject: Géomorphologie @fr
subject: Geomorphology
alternative label: sink holes
alternative label: sinks
definition: Dépressions circulaires du modelé karstique dont le fond présente des accumulations de terre fine. (Source : INRA) @fr
in scheme: PLP
note: Les dolines d'effondrement sont presque aussi profondes que larges et résultent de l'effondrement de cavités souterraines. Les dolines de dissolution sont peu profondes et résultent de la dissolution localement plus intense des roches calcaires sous-jacentes. (Source : INRA) @fr
top concept of: PLP