dolomie
type: Concept
subject: Geology @en
subject: Pedology @en
subject: Géologie
subject: Pédologie
definition: Roche sédimentaire carbonatée contenant 50 % ou plus de carbonates dont la moitié au moins sous forme de dolomite. (Source : INRA)
in scheme: PLP
preferred label: dolostone @en
related: http://opendata.inrae.fr/PLP/281
top concept of: PLP

RDF description of
primary topic: dolomie