dolomite
type: Concept
subject: Geology
subject: Pedology
subject: Géologie @fr
subject: Pédologie @fr
definition: Carbonate double de calcium et de magnésium. (Source : INRA) @fr
in scheme: PLP
related: http://opendata.inrae.fr/PLP/280
related: http://opendata.inrae.fr/PLP/155
related: http://opendata.inrae.fr/PLP/585
top concept of: PLP

RDF description of
primary topic: dolomite