RDF description of
primary topic: drainage agricole

drainage agricole
type: Concept
subject: Agronomie
subject: Agronomy @en
definition: Évacuation des eaux superficielles ou souterraines excédentaires au moyen de drains enterrés ou de fossés. (Source : INRA)
in scheme: PLP
preferred label: land drainage @en
related: http://opendata.inrae.fr/PLP/350
related: http://opendata.inrae.fr/PLP/792
top concept of: PLP