RDF description of
primary topic: dystrique

dystrique
type: Concept
subject: Pedology @en
subject: Pédologie
definition: Qualifie un solum ou un horizon dont le taux de saturation du complexe adsorbant est inférieur à 50 % (Référentiel Pédologique et WRB). (Source : INRA)
in scheme: PLP
preferred label: dystric @en
top concept of: PLP