dystrophe
type: Concept
subject: Pedology @en
subject: Pédologie
definition: Qualifie un horizon ou un sol dans lequel les conditions de nutrition des plantes sont mauvaises, soit pour des raisons chimiques (manque de calcium), soit pour des raisons physiques (manque d'oxygène). (Source : INRA)
in scheme: PLP
preferred label: dystrophic @en
related: http://opendata.inrae.fr/PLP/599
related: http://opendata.inrae.fr/PLP/658
related: http://opendata.inrae.fr/PLP/347
top concept of: PLP

RDF description of
primary topic: dystrophe