eau capillaire
type: Concept
subject: Pedology @en
subject: Hydrologie
subject: Hydrology @en
subject: Pédologie
definition: Eau retenue dans la porosité d'un horizon sous l'effet des forces capillaires. (Source : INRA)
in scheme: PLP
note: Une partie de cette eau est utilisable par les racines des plantes. (Source : INRA)
note: S'oppose à eau gravitaire. (Source : INRA)
preferred label: capillary water @en
related: http://opendata.inrae.fr/PLP/609
related: http://opendata.inrae.fr/PLP/398
top concept of: PLP

RDF description of
primary topic: eau capillaire