eau de constitution
type: Concept
subject: Mineralogy @en
subject: Pedology @en
subject: Minéralogie
subject: Pédologie
definition: Eau entrant dans la composition chimique de certains minéraux, notamment des minéraux argileux ou de certains oxydes de fer. (Source : INRA)
in scheme: PLP
note: C'est seulement par chauffage à des températures supérieures à 350 °C que cette eau peut être extraite. (Source : INRA)
preferred label: combined water @en
top concept of: PLP

RDF description of
primary topic: eau de constitution