RDF description of
primary topic: eau régale

eau régale
type: Concept
subject: Pedology @en
subject: Chemistry @en
subject: Pédologie
subject: Chimie
definition: Mélange d'acide nitrique et d'acide chlorhydrique employé pour la mise en solution d'échantillons de sols, de roches ou de sédiments, pour dosage des éléments traces. (Source : INRA)
in scheme: PLP
note: Ce réactif ne permet pas d'atteindre des teneurs véritablement totales car il est incapable de dissoudre la totalité des silicates. Il fournit des teneurs dites " pseudo-totales ". (Source : INRA)
preferred label: aqua regia @en
related: http://opendata.inrae.fr/PLP/858
related: http://opendata.inrae.fr/PLP/949
top concept of: PLP