RDF description of
primary topic: alcalin (Géologie)

alcalin (Géologie)
type: Concept
subject: Geology @en
subject: Géologie
definition: Qualifie diverses roches plus ou moins riches en ions Na et/ou K (granites, basaltes). (Source : INRA)
in scheme: PLP
preferred label: alkaline (Geology) @en
top concept of: PLP