écobuage
type: Concept
subject: Pedology @en
subject: Pédologie
subject: Foresterie
subject: Forestry @en
alternative label: ash farming @en
definition: Pratique ancienne d'aménagement sylvo-pastoral consistant à découper en mottes la couche la plus superficielle du sol (avec herbes et racines), à entasser ces mottes, puis à les brûler, enfin à répandre les cendres. (Source : INRA)
in scheme: PLP
note: Ce terme désigne plus largement la pratique consistant à brûler directement les végétaux sur pied. (Source : INRA)
preferred label: slashing and burning @en
top concept of: PLP

RDF description of
primary topic: écobuage