RDF description of
primary topic: écosystème

écosystème
type: Concept
subject: Ecology @en
subject: Écologie
definition: Unité écologique de base, fonctionnelle et spatiale, associant un milieu naturel de vie (le biotope) et l'ensemble des êtres vivants qui occupent ce milieu (la biocénose). (Source : INRA)
in scheme: PLP
preferred label: ecosystem @en
related: http://opendata.inrae.fr/PLP/27
top concept of: PLP