édaphique
type: Concept
subject: Pedology @en
subject: Pédologie
definition: Qualifie les conditions ou les facteurs relatifs aux sols régissant la vie végétale et animale. (Source : INRA)
in scheme: PLP
preferred label: edaphic @en
top concept of: PLP

RDF description of
primary topic: édaphique