RDF description of
primary topic: effet baignoire

effet baignoire
type: Concept
subject: Pedology @en
subject: Pédologie
definition: Présence d'une grande quantité d'eau stagnant dans une fosse ouverte depuis plusieurs jours (voire plusieurs semaines) et qui n'est pas en équilibre avec une nappe fonctionnelle. (Source : INRA)
in scheme: PLP
note: Il s'agit d'une eau piégée dans un trou aux parois imperméables. Si l'on retire cette eau piégée, la fosse ne se remplira pas aussitôt. (Source : INRA)
top concept of: PLP