RDF description of
primary topic: efflorescences

efflorescences
type: Concept
subject: Pedology @en
subject: Pédologie
definition: Cristallisations de sels solubles, localisées à la surface du sol, de fentes ou d'agrégats, suite à une forte dessiccation. (Source : INRA)
in scheme: PLP
top concept of: PLP