RDF description of
primary topic: éléments fertilisants

éléments fertilisants
type: Concept
subject: Pedology @en
subject: Agronomie
subject: Pédologie
subject: Agronomy @en
definition: Éléments essentiels de la nutrition des plantes (azote, phosphore et potassium) dont les composés peuvent seuls réglementairement être qualifiés d'engrais. (Source : INRA)
in scheme: PLP
preferred label: nutrients @en
related: http://opendata.inrae.fr/PLP/706
related: http://opendata.inrae.fr/PLP/96
related: http://opendata.inrae.fr/PLP/656
related: http://opendata.inrae.fr/PLP/745
top concept of: PLP