RDF description of
primary topic: éléments grossiers

éléments grossiers
type: Concept
subject: Pedology @en
subject: Agronomie
subject: Pédologie
subject: Agronomy @en
definition: Ensemble des constituants minéraux individualisés (fragments élémentaires de roches, poly- ou mono-minéraux) de dimensions supérieures à 2 mm. (Source : INRA)
in scheme: PLP
note: Même s'ils ont perdu, partiellement ou totalement, leur structure lithique originelle par altération, ces éléments n'ont pas acquis de structure pédologique. Ils ne doivent donc pas être confondus avec des agrégats. Sont considérés également comme éléments grossiers certains nodules suffisamment gros et durs. Leur description se fait indépendamment de celle des constituants plus fins (terre fine). La séparation d'avec la terre fine se fait grâce à une passoire à trous ronds de 2 mm. Selon leur (plus grande) dimension, il faut distinguer : les graviers (0,2 à 2 cm) les cailloux (2 à 5 ou 7,5 cm), les pierres (5 ou 7,5 à 20 cm), les blocs (plus de 20 cm). (Source : INRA)
preferred label: coarse fragments @en
related: http://opendata.inrae.fr/PLP/170
related: http://opendata.inrae.fr/PLP/791
related: http://opendata.inrae.fr/PLP/652
related: http://opendata.inrae.fr/PLP/323
related: http://opendata.inrae.fr/PLP/960
related: http://opendata.inrae.fr/PLP/711
related: http://opendata.inrae.fr/PLP/700
related: http://opendata.inrae.fr/PLP/117
related: http://opendata.inrae.fr/PLP/468
related: http://opendata.inrae.fr/PLP/127
top concept of: PLP