RDF description of
primary topic: éléments majeurs

éléments majeurs
type: Concept
subject: Geology @en
subject: Pedology @en
subject: Géologie
subject: Agronomie
subject: Pédologie
subject: Agronomy @en
definition: Éléments chimiques, principaux constituants de la croûte terrestre, dont la concentration a été évaluée comme supérieure à 0,1 % pour chacun. (Source : INRA)
in scheme: PLP
note: Ce sont, par ordre d'abondance décroissante, l'oxygène, le silicium, l'aluminium, le fer, le calcium, le sodium, le potassium, le magnésium, le titane, l'hydrogène, le phosphore et le manganèse. Ils représenteraient 99,4 % (en masse). (Source : INRA)
preferred label: major elements @en
related: http://opendata.inrae.fr/PLP/580
related: http://opendata.inrae.fr/PLP/318
related: http://opendata.inrae.fr/PLP/320
top concept of: PLP