éléments en traces
type: Concept
subject: Geology @en
subject: Pedology @en
subject: Géologie
subject: Agronomie
subject: Pédologie
subject: Agronomy @en
alternative label: éléments traces
definition: Ensemble des 80 éléments chimiques dont la concentration dans la croûte terrestre est évaluée, pour chacun d'entre eux, comme inférieure à 0,1 %. (Source : INRA)
in scheme: PLP
note: Certains éléments en traces sont indispensables au déroulement des processus biologiques : ce sont les oligoéléments. La plupart des oligoéléments peuvent s'avérer nocifs pour tel ou tel compartiment d'un écosystème dès que leur teneur devient trop élevée (Cu, Zn, Mo, As, Se). D'autres éléments en traces dont le caractère indispensable n'est pas démontré, sont également toxiques au-delà d'une certaine concentration (Cd, Hg, Pb, Sn). La détermination d'un seuil de toxicité est particulièrement délicat, car le risque de toxicité dépend largement de la cible, de la nature du sol et des formes chimiques prises par l'élément. (Source : INRA)
preferred label: trace elements @en
related: http://opendata.inrae.fr/PLP/183
related: http://opendata.inrae.fr/PLP/948
related: http://opendata.inrae.fr/PLP/818
related: http://opendata.inrae.fr/PLP/196
related: http://opendata.inrae.fr/PLP/126
related: http://opendata.inrae.fr/PLP/601
related: http://opendata.inrae.fr/PLP/656
related: http://opendata.inrae.fr/PLP/317
related: http://opendata.inrae.fr/PLP/249
related: http://opendata.inrae.fr/PLP/238
related: http://opendata.inrae.fr/PLP/602
top concept of: PLP

RDF description of
primary topic: éléments en traces