éléments secondaires (Agronomie)
type: Concept
subject: Agronomie
subject: Agronomy @en
definition: Éléments chimiques (tels Ca, Mg, S, Fe) nécessaires à la croissance des plantes en assez grande quantité, présents dans le sol ou apportés en complément. (Source : INRA)
in scheme: PLP
note: Ces éléments ont été nommés ainsi pour les distinguer de C, O, H, N, P et K d'une part et des oligoéléments d'autre part. (Source : INRA)
preferred label: secondary nutrients @en
related: http://opendata.inrae.fr/PLP/656
related: http://opendata.inrae.fr/PLP/317
top concept of: PLP

RDF description of
primary topic: éléments secondaires (Agronomie)