RDF description of
primary topic: éluviation

éluviation
type: Concept
subject: Pedology @en
subject: Pédologie
definition: Départ d'un constituant par lessivage vertical ou latéral. (Source : INRA)
in scheme: PLP
preferred label: eluviation @en
related: http://opendata.inrae.fr/PLP/507
related: http://opendata.inrae.fr/PLP/464
related: http://opendata.inrae.fr/PLP/321
related: http://opendata.inrae.fr/PLP/548
related: http://opendata.inrae.fr/PLP/568
top concept of: PLP