enrichissement
type: Concept
subject: Pedology @en
subject: Pédologie
definition: Augmentation de la proportion d'un constituant dans un horizon ou un volume de sol. (Source : INRA)
in scheme: PLP
note: Toute teneur plus élevée en un élément (argile, fer, plomb, etc.) dans un horizon par rapport à un autre horizon du même solum n'implique pas forcément un transfert de l'un vers l'autre (ni un apport extérieur) et ne mérite pas forcément d'être appelé enrichissement. Dans certains cas, cela résulte seulement d'une accumulation relative (suite, par exemple à une décarbonatation). Dans d'autres cas, cela résulte d'un appauvrissement de l'horizon présentant la plus faible teneur, sans accumulation absolue dans l'horizon présentant la teneur la plus élevée. (Source : INRA)
preferred label: enrichment @en
related: http://opendata.inrae.fr/PLP/254
related: http://opendata.inrae.fr/PLP/64
related: http://opendata.inrae.fr/PLP/176
related: http://opendata.inrae.fr/PLP/4
top concept of: PLP

RDF description of
primary topic: enrichissement