épigénie
type: Concept
subject: Geology @en
subject: Pedology @en
subject: Géologie
subject: Pédologie
alternative label: remplacement épigénétique
alternative label: métasomatose
definition: Remplacement progressif dans une roche en cours d'altération, à basse température et basse pression, d'un minéral par un autre minéral, atome par atome. (Source : INRA)
in scheme: PLP
note: Les éléments de remplacement soit n'existaient pas dans le minéral initial, soit n'étaient présents qu'en faible concentration. (Source : INRA)
preferred label: epigenesis @en
top concept of: PLP

RDF description of
primary topic: épigénie