RDF description of
primary topic: érosion par ravinement

érosion par ravinement
type: Concept
subject: Pedology @en
subject: Pédologie
alternative label: érosion en ravines
definition: Mode d'érosion par ruissellement concentré, accentuation de l'érosion en rigoles, s'exprimant sous la forme de ravines qui sont trop profondes et trop larges pour être effacées ensuite par de simples façons culturales. (Source : INRA)
in scheme: PLP
preferred label: gully erosion @en
related: http://opendata.inrae.fr/PLP/335
related: http://opendata.inrae.fr/PLP/334
related: http://opendata.inrae.fr/PLP/822
related: http://opendata.inrae.fr/PLP/336
top concept of: PLP