érosivité
type: Concept
subject: Pedology @en
subject: Agronomie
subject: Pédologie
subject: Agronomy @en
definition: Capacité des pluies ou du vent à provoquer l'érosion des sols, dans des circonstances précises (type de sol, pente, couvert végétal). (Source : INRA)
in scheme: PLP
preferred label: erosivity @en
related: http://opendata.inrae.fr/PLP/333
top concept of: PLP

RDF description of
primary topic: érosivité