RDF description of
primary topic: alios

alios
type: Concept
subject: Pedology @en
subject: Pédologie
modified: 2020-08-27T15:20:51.886+02:00
alternative label: hardpan @en
alternative label: ortstein
definition: Horizon d'accumulation induré constitué de sables cimentés par des matières organiques mais surtout par des oxydes de fer et parfois de manganèse et d'aluminium. (Source : INRA)
in scheme: PLP
note: La compacité de l'alios le rend imperméable et infranchissable pour les racines. Il correspond le plus souvent à des horizons BP indurés de certains podzols (Landes de Gascogne), mais on observe également des alios sans rapport avec la podzolisation, résultant de l'accumulation de fer dans la zone d'oscillation de nappes (alios de nappe). (Source : INRA)
preferred label: iron pan @en
related: http://opendata.inrae.fr/PLP/475
top concept of: PLP