état d'aération
type: Concept
subject: Pedology @en
subject: Pédologie
definition: État favorable à la respiration des racines et à l'activité biologique en général. (Source : INRA)
in scheme: PLP
note: L'état d'aération d'un horizon dépend de sa porosité (volume total, dimensions des vides) et de l'occupation plus ou moins complète de cette porosité par l'eau à un moment donné. (Source : INRA)
preferred label: aeration @en
related: http://opendata.inrae.fr/PLP/20
top concept of: PLP

RDF description of
primary topic: état d'aération