état d'humidité
type: Concept
subject: Pedology @en
subject: Pédologie
definition: Humidité d'un horizon, telle que ressentie et observée sur le terrain à l'aide de sensations tactiles mais aussi à l'aide d'autres impressions comme, par exemple, le comportement mécanique. (Source : INRA)
in scheme: PLP
note: Cinq modalités peuvent être raisonnablement distinguées : - sec (pas d'humidité décelable) ; - frais ; - humide (échantillon malléable, humidité voisine de la capacité au champ, absence d'eau libre) ; - très humide ; - noyé (présence d'eau libre, saturant tout ou partie de la porosité). (Source : INRA)
preferred label: soil moisture conditions @en
related: http://opendata.inrae.fr/PLP/397
related: http://opendata.inrae.fr/PLP/485
top concept of: PLP

RDF description of
primary topic: état d'humidité