étude du profil cultural
type: Concept
subject: Pedology @en
subject: Agronomie
subject: Pédologie
subject: Agronomy @en
definition: Méthode d'observation et de description détaillée des couches superficielles individualisées par l'intervention des instruments de culture et par les racines des végétaux cultivés, visant à porter un diagnostic agronomique quant à l'état physique et structural de la partie supérieure d'un solum cultivé, en vue d'apprécier les effets des pratiques culturales. (Source : INRA)
in scheme: PLP
preferred label: arable profile @en
related: http://opendata.inrae.fr/PLP/331
related: http://opendata.inrae.fr/PLP/471
related: http://opendata.inrae.fr/PLP/755
top concept of: PLP

RDF description of
primary topic: étude du profil cultural