alisols
type: Concept
subject: Pedology @en
subject: Pédologie
definition: Groupes de sols de référence caractérisés par une forte acidité et un horizon profond d'accumulation d'argile (horizon argique), que l'on observe dans les zones tropicales et subtropicales humides et les régions tempérées chaudes (WRB). (Source : INRA)
in scheme: PLP
note: L'altération est tellement intense que les minéraux argileux 2/1 sont dégradés et libèrent de grandes quantités d'aluminium échangeable. Il reste très peu de minéraux primaires altérables. Les minéraux argileux présentent cependant une forte capacité d'échange cationique (CEC), c'est pourquoi ces sols peuvent devenir productifs après chaulage et fertilisation intensive. (Source : INRA)
related: http://opendata.inrae.fr/PLP/15
top concept of: PLP

RDF description of
primary topic: alisols