RDF description of
primary topic: extrait de pâte saturée

extrait de pâte saturée
type: Concept
subject: Pedology @en
subject: Pédologie
definition: Méthode d'extraction des sels solubles présents dans un échantillon de sol par laquelle on cherche à se rapprocher des conditions in situ, tout en opérant selon des conditions standardisées. (Source : INRA)
in scheme: PLP
note: L'échantillon préalablement séché est amené à saturation (à sa limite de liquidité) par malaxage avec de l'eau distillée. La confection de la pâte nécessite au moins 300 g de terre afin d'obtenir 50 cm3 de solution d'extraction. On crée ainsi un rapport terre/ eau variable selon la texture (par exemple 1/2 pour une texture argileuse et 1/5 pour un échantillon sableux). La salinité de l'extrait de pâte saturée est déterminée par la mesure de la conductivité électrique. (Source : INRA)
preferred label: saturated paste extract @en
related: http://opendata.inrae.fr/PLP/552
related: http://opendata.inrae.fr/PLP/211
related: http://opendata.inrae.fr/PLP/830
top concept of: PLP