RDF description of
primary topic: faces luisantes

faces luisantes
type: Concept
subject: Pedology @en
subject: Pédologie
definition: Faces d'agrégats lisses, luisantes à tous les états d'humidité, résultant de la présence soit d'argilanes généralisés, soit de faces de pression à argiles orientées. (Source : INRA)
in scheme: PLP
preferred label: shining faces of peds @en
related: http://opendata.inrae.fr/PLP/73
related: http://opendata.inrae.fr/PLP/862
top concept of: PLP