faune du sol
type: Concept
subject: Pedology @en
subject: Pédologie
definition: Ensemble des animaux habitant dans les sols et particulièrement ceux qui jouent un rôle dans la décomposition des litières. (Source : INRA)
in scheme: PLP
note: Selon leurs dimensions on distingue : - la microfaune seulement observable au microscope (dimensions inférieures à 0,4 mm - par ex. protozoaires, certains nématodes) ; - la mésofaune (dimensions comprises entre 0,2 et 4 mm - par ex. larves de diptères, vers enchytraeides, petits arthropodes) ; et la macrofaune (dimensions comprises entre 4 et 80 mm - par ex. lombrics, isopodes, diplopodes, mollusques, termites et autres insectes). (Source : INRA)
preferred label: soil fauna @en
related: http://opendata.inrae.fr/PLP/606
related: http://opendata.inrae.fr/PLP/581
related: http://opendata.inrae.fr/PLP/597
top concept of: PLP

RDF description of
primary topic: faune du sol