fentes en coin
type: Concept
subject: Geology @en
subject: Pedology @en
subject: Géologie
subject: Pédologie
definition: Fentes verticales formées en climat périglaciaire dans des matériaux meubles par élargissement d'un coin de glace. (Source : INRA)
in scheme: PLP
note: Ces fentes sont encore observables de nos jours dans certains solums et sur certaines photographies aériennes. Elles forment un réseau hexagonal d'environ 10 m de diamètre. Leur profondeur peut atteindre plusieurs mètres. (Source : INRA)
preferred label: ice wedges @en
related: http://opendata.inrae.fr/PLP/880
top concept of: PLP

RDF description of
primary topic: fentes en coin