RDF description of
primary topic: ferromanganique

ferromanganique
type: Concept
subject: Pedology @en
subject: Pédologie
definition: Qualifie divers traits pédologiques d'accumulation (nodules, revêtements, etc.) constitués principalement de fer et de manganèse et, de ce fait, colorés en noir ou brun-noir. (Source : INRA)
in scheme: PLP
preferred label: ferri-manganiferous @en
top concept of: PLP