fersialsols
type: Concept
subject: Pedology @en
subject: Pédologie
definition: Grands ensembles de référence caractérisées par une pédogenèse fersiallitique (Référentiel Pédologique). (Source : INRA)
in scheme: PLP
related: http://opendata.inrae.fr/PLP/683
related: http://opendata.inrae.fr/PLP/467
related: http://opendata.inrae.fr/PLP/922
top concept of: PLP

RDF description of
primary topic: fersialsols