fertilité d'un sol
type: Concept
subject: Pedology @en
subject: Agronomie
subject: Pédologie
subject: Agronomy @en
subject: Foresterie
subject: Forestry @en
definition: Aptitude d'un sol à fournir des récoltes. (Source : INRA)
in scheme: PLP
note: La fertilité ne peut donc être valablement estimée que lorsque la culture envisagée est précisée (blé, maïs, vigne, bois d'œuvre, truffes, etc.). La fertilité d'un sol à telle ou telle utilisation dépend de toute une série de caractères. C'est pourquoi on peut distinguer une fertilité physique (netteté et stabilité de la structure, compacité, aération, épaisseur), une fertilité chimique (capacité d'échange, garniture cationique du complexe adsorbant, éléments majeurs et oligo-éléments assimilables), une fertilité hydrique (capacité de rétention et de cession de l'eau aux racines, en cas de besoin) et une fertilité biologique (richesse, variété et activité de la méso- et de la microfaune du sol). (Source : INRA)
preferred label: soil fertility @en
related: http://opendata.inrae.fr/PLP/348
top concept of: PLP

RDF description of
primary topic: fertilité d'un sol