fimique
type: Concept
subject: Pedology @en
subject: Pédologie
definition: Qualifie un anthroposol dont l'horizon de surface est devenu très humifère par suite d'épandages répétés de fumiers ou lisiers (Référentiel Pédologique). (Source : INRA)
in scheme: PLP
note: Un horizon labouré fimique est très épais (plus de 30 cm) et contient généralement des débris de briques ou de poteries sur toute son épaisseur. Sa teneur en éléments fertilisants est très élevée, notamment en P2O5 (plus de 250 mg/kg, extraction à l'acide citrique). (Source : INRA)
preferred label: fimic @en
related: http://opendata.inrae.fr/PLP/61
top concept of: PLP

RDF description of
primary topic: fimique