RDF description of
primary topic: fonctionnements d'un sol

fonctionnements d'un sol
type: Concept
subject: Pedology @en
subject: Pédologie
alternative label: soil functioning @en
definition: Successions, à court pas de temps (jour, semaine, saison), des phénomènes relatifs à la circulation et à la rétention de l'eau, au jeu des agrégats, à l'activité biologique, et aux températures, dans les différents horizons d'un sol. (Source : INRA)
in scheme: PLP
note: Ces quatre fonctionnements (hydrique, structural, biologique et thermique) ne sont pas indépendants. (Source : INRA)
preferred label: soil dynamics @en
related: http://opendata.inrae.fr/PLP/682
top concept of: PLP