fonctions de pédotransfert
type: Concept
subject: Pedology @en
subject: Pédologie
alternative label: PTFs @en
definition: Relations statistiques permettant de relier des caractéristiques assez facilement déterminées en routine sur échantillons de sols, et de ce fait plus aisément cartographiables, à des propriétés ou des comportements beaucoup plus difficiles à mesurer directement et en de nombreux points. (Source : INRA)
in scheme: PLP
note: Initialement employées pour estimer les quantités d'eau retenues à certaines valeurs de potentiel matriciel à partir de déterminations simples comme les données granulométriques, les teneurs en carbone, la capacité d'échange cationique (CEC), le volume massique, etc. Utilisées désormais pour estimer d'autres variables, par exemple prédire les propriétés d'adsorption d'horizons profonds vis-à-vis des produits phytosanitaires à partir des paramètres de constitution. Cette notion a été élargie récemment vers celle de règles de pédotransfert dans lesquelles les relations sont moins purement mathématiques et plus définies en termes de système expert. (Source : INRA)
preferred label: pedotransfer functions @en
top concept of: PLP

RDF description of
primary topic: fonctions de pédotransfert