fonctions des sols
type: Concept
subject: Pedology @en
subject: Pédologie
definition: Fonctions multiples, souvent contradictoires, assignées aux couvertures pédologiques et dont les importances relatives dépendent des spécificités culturelles et du degré de développement technique des sociétés humaines. (Source : INRA)
in scheme: PLP
note: Selon cette vision délibérément anthropocentrique, on peut distinguer neuf fonctions : fonctions de production agricole et de production forestière, support de la végétation à des fins non productives, équilibre des écosystèmes terrestres, fourniture de matériaux utiles (terre de bruyère, tourbe, minerais), usage géotechnique (support de constructions légères), rôle dans le cycle de l'eau, lieu d'épandage de nos déchets, mémoire des sociétés humaines (lieu de fouilles archéologiques). (Source : INRA)
preferred label: soil functions @en
related: http://opendata.inrae.fr/PLP/766
related: http://opendata.inrae.fr/PLP/348
top concept of: PLP

RDF description of
primary topic: fonctions des sols