fond matriciel
type: Concept
subject: Pedology @en
subject: Pédologie
alternative label: matrice
alternative label: masse basale
alternative label: groundmass @en
alternative label: soil matrix @en
definition: Ensemble des matières (plasma, grains de squelette et vides associés) constituant les agrégats élémentaires (ou un matériau pédologique apédique) mais non intégrés à des traits pédologiques autres que des séparations plasmiques. (Source : INRA)
in scheme: PLP
preferred label: s-matrix @en
related: http://opendata.inrae.fr/PLP/979
related: http://opendata.inrae.fr/PLP/935
related: http://opendata.inrae.fr/PLP/1002
related: http://opendata.inrae.fr/PLP/663
related: http://opendata.inrae.fr/PLP/467
top concept of: PLP

RDF description of
primary topic: fond matriciel