fond pédogéochimique naturel
type: Concept
subject: Pedology @en
subject: Pédologie
subject: Géochimie
subject: Geochemistry @en
alternative label: FPGN
alternative label: natural pedogeochemical background @en
alternative label: concentration pédogéochimique naturelle
definition: Concentration naturelle d'un élément majeur ou trace dans un horizon de sol, résultant uniquement de l'évolution géologique et pédologique, à l'exclusion de tout apport d'origine anthropique. (Source : INRA)
in scheme: PLP
note: L'héritage initial du matériau parental (fond géochimique) est progressivement plus ou moins modifié par les processus pédogénétiques de différenciation des horizons. D'un point à un autre de l'espace géographique, cette concentration peut varier très largement, en fonction de la nature du matériau parental et du type de sol qui s'est développé (types de processus pédogénétiques et leur durée d'action). Il faut donc toujours préciser le territoire pour lequel ce fond pédo-géochimique est considéré (parcelle, bassin versant, région, pays, territoire d'existence d'une unité typologique). (Source : INRA)
preferred label: natural pedogeochemical concentration @en
related: http://opendata.inrae.fr/PLP/948
related: http://opendata.inrae.fr/PLP/383
top concept of: PLP

RDF description of
primary topic: fond pédogéochimique naturel