RDF description of
primary topic: superficial deposits

superficial deposits
type: Concept
subject: Geology
subject: Pedology
subject: Géologie @fr
subject: Pédologie @fr
alternative label: surficial deposits
alternative label: surface deposits
definition: Formations géologiques apparaissant en surface sous l'influence de l'action météorique résultant de la désagrégation physique et/ou de l'altération chimique de roches préexistantes. (Source : INRA) @fr
in scheme: PLP
note: Elles peuvent rester en place, au-dessus de la roche qui leur a donné naissance (formations autochtones), être déplacées sur de courtes distances (formations subautochtones), être remobilisées par les agents de la géodynamique de surface (gravité, glace, eau, vent) et secondairement déposées (formations allochtones), et être exceptionnellement enfouies. D'épaisseur métrique à pluri-décamétrique, elles sont en relation avec la topographie actuelle. Des paléo-formations superficielles (bauxites, altérites tertiaires, etc.) révèlent des paléosurfaces. Sous l'effet de la pédogenèse, la partie supérieure des formations superficielles évolue en sols, dont l'organisation et le fonctionnement ont leurs règles propres. Elles sont souvent le véritable matériau parental des sols. (Source : INRA) @fr
preferred label: formations superficielles @fr
related: http://opendata.inrae.fr/PLP/592
top concept of: PLP