formes d'humus
type: Concept
subject: Pedology @en
subject: Pédologie
definition: Ensemble des caractères morphologiques macroscopiques de l'épisolum humifère (horizons O et A et leur succession), dépendant de son mode de fonctionnement (Référentiel Pédologique). (Source : INRA)
in scheme: PLP
note: Il est conseillé d'utiliser le mot humus, employé seul, pour désigner la fraction des matières organiques du sol transformée par voie biochimique. (Source : INRA)
preferred label: humus forms @en
related: http://opendata.inrae.fr/PLP/627
related: http://opendata.inrae.fr/PLP/1013
related: http://opendata.inrae.fr/PLP/57
related: http://opendata.inrae.fr/PLP/495
related: http://opendata.inrae.fr/PLP/331
related: http://opendata.inrae.fr/PLP/472
related: http://opendata.inrae.fr/PLP/500
related: http://opendata.inrae.fr/PLP/497
related: http://opendata.inrae.fr/PLP/775
related: http://opendata.inrae.fr/PLP/634
related: http://opendata.inrae.fr/PLP/623
related: http://opendata.inrae.fr/PLP/501
related: http://opendata.inrae.fr/PLP/457
top concept of: PLP

RDF description of
primary topic: formes d'humus