fosse pédologique
type: Concept
subject: Pedology @en
subject: Pédologie
alternative label: soil trench @en
definition: Fosse creusée pour pouvoir observer, décrire et prélever une couverture pédologique en un point donné. (Source : INRA)
in scheme: PLP
note: Une telle fosse doit être de profondeur suffisante pour pouvoir recouper tous les horizons, y compris la partie supérieure de la roche sous-jacente. (Source : INRA)
preferred label: soil pit @en
related: http://opendata.inrae.fr/PLP/630
related: http://opendata.inrae.fr/PLP/885
related: http://opendata.inrae.fr/PLP/755
related: http://opendata.inrae.fr/PLP/887
top concept of: PLP

RDF description of
primary topic: fosse pédologique