fraction granulométrique argiles
type: Concept
subject: Pedology @en
subject: Agronomie
subject: Pédologie
subject: Agronomy @en
modified: 2020-08-27T15:00:10.120+02:00
alternative label: clay particle @en
alternative label: argiles
definition: Ensemble des particules de dimension inférieure à 2 micromètres. (Source : INRA)
in scheme: PLP
preferred label: clay fraction @en
related: http://opendata.inrae.fr/PLP/394
top concept of: PLP

RDF description of
primary topic: fraction granulométrique argiles