fragilité
type: Concept
subject: Pedology @en
subject: Pédologie
definition: Propriété, déterminée à l'état sec, d'un agrégat ou d'une motte d'être fragmenté plus ou moins facilement avec les mains. (Source : INRA)
in scheme: PLP
preferred label: consistence when dry @en
related: http://opendata.inrae.fr/PLP/399
top concept of: PLP

RDF description of
primary topic: fragilité