fragipan
type: Concept
subject: Pedology @en
subject: Pédologie
definition: Horizon non situé en surface, de texture moyenne et pauvre en matières organiques, très compact à l'état sec et présentant une densité apparente élevée. (Source : INRA)
in scheme: PLP
note: Un tel horizon constitue un obstacle à la percolation verticale de l'eau et au passage des racines. (Source : INRA)
top concept of: PLP

RDF description of
primary topic: fragipan